{"text_format":"1","workbook":"xlsx","n_sheets":6,"sheets":["97-A","97-B","Instructions for 97A","Instructions for 97B","Annexure-97A","Annexure-97B"],"not_rendered":{"charts":0,"images":1,"macros":1,"external_links":0,"defined_names":4,"comments":2,"pivot_tables":0},"unopened":[],"bounds":{"document_bytes":16777216,"sheet_cells":100000,"rows_first":2000,"rows_last":500,"rows_between":2000,"halvings":0,"cell_chars":16384,"cell_head_chars":4096},"cells_cut":0,"cells_raw":0,"read":"whole","date_system":"1900"}

{"sheet":"97-A","index":0,"n_rows":1000,"n_cols":90,"rows_kept":1000,"cut":false,"hidden":false,"merged":[[52,1,52,8],[9,2,9,5],[58,1,58,3],[59,1,59,3],[14,0,14,1],[15,0,15,1],[48,0,48,1],[49,0,49,1],[50,0,50,1],[35,6,35,8],[31,6,31,8],[46,3,46,5],[38,4,38,5],[39,4,39,5],[34,6,34,8],[16,2,16,5],[17,2,17,5],[21,3,21,5],[26,3,26,5],[27,3,27,5],[28,3,28,5],[29,3,29,5],[30,3,30,5],[27,6,27,8],[8,0,8,1],[9,0,9,1],[11,0,11,1],[12,0,12,1],[13,0,13,1],[51,0,51,1],[47,3,47,5],[35,2,35,5],[36,3,36,5],[51,2,51,3],[50,2,50,3],[49,2,49,3],[8,2,8,5],[48,2,48,3],[23,3,23,5],[24,3,24,5],[32,1,32,5],[33,1,33,5],[31,3,31,5],[11,2,11,5],[12,2,12,5],[13,2,13,5],[14,2,14,5],[37,3,37,5],[16,6,17,8],[38,7,45,8],[40,4,40,5],[41,4,41,5],[42,4,42,5],[43,4,43,5],[44,4,44,5],[45,2,45,5],[32,6,32,8],[33,6,33,8],[59,6,59,8],[12,6,12,8],[11,6,11,8],[4,6,4,8],[6,6,6,8],[7,6,7,8],[8,6,8,8],[13,6,13,8],[14,6,14,8],[20,6,20,8],[19,6,19,8],[21,6,21,8],[22,6,22,8],[23,6,23,8],[36,6,36,8],[46,6,46,8],[47,6,47,8],[37,6,37,8],[48,6,51,8],[18,6,18,8],[15,6,15,8],[55,0,55,8],[53,0,53,8],[54,0,54,8],[0,0,0,8],[2,0,2,8],[26,6,26,8],[24,6,24,8],[25,6,25,8],[29,6,29,8],[28,6,28,8],[30,6,30,8],[4,2,4,5],[6,2,6,5],[7,2,7,5],[4,0,7,0],[3,0,3,6],[15,2,15,5],[19,3,19,5],[18,2,18,5],[20,3,20,5],[5,2,5,5],[5,6,5,8],[10,0,10,1],[10,2,10,5],[10,6,10,8],[9,6,9,7],[25,3,25,5]]}
["Central Pollution Control Board, Delhi"]
[null,null,null,null,null,null,null,null,"Med. 97-A"]
["Form of application for claiming refund of medical expenses incurred\n in connection with medical attendance and/or treatment of \nCentral Government servants or their families for treatment in a Hospital"]
[null,null,null,null,null,null,null,"CP NO.","CPCB0000"]
[1,null,"Name of Government Servant \n(In block letters)",null,null,null,{"$f":"VLOOKUP($I$4, $A$499:$CL$999,3,)","v":0}]
[null,null,"Degination of the Government Servent\n(In block letters)",null,null,null,{"$f":"VLOOKUP($I$4, $A$499:$CL$999,2,)","v":0}]
[null,"(i)","whether married or unmarried \n(Strike out which ever is not applicable)",null,null,null,"YES   /    NO"]
[null,"(ii)","if yes, the place where wife/husband is employed"]
[2,null,"Office in which employed",null,null,null,{"$f":"VLOOKUP($I$4,$A$501:$CL$1001,5,)","v":0}]
[3,null,"Pay of the Government servant as defined in the Fundamental Rules, and any other emoluments which should be shown separately",null,null,null,"BASIC ",null,{"$f":"VLOOKUP($I$4,$A$501:$CL$1001,9,)","v":0}]
[4,null,"Level of Pay and applied Cell",null,null,null,{"$f":"VLOOKUP($I$4, $A$499:$CL$999,85,)","v":0}]
[5,null,"Place of duty",null,null,null,{"$f":"VLOOKUP($I$4,$A$501:$CL$1001,5,)","v":0}]
[6,null,"Actual residential address"]
[7,null,"Name of the patient and his/her relationship to the Government servant\nN.B. - In the case of children, state age also.",null,null,null,"SELF"]
[8,null,"Place at which the patient fell ill"]
[9,null,"Details of the amount claimed:"]
[null,null,"I. Hospital Treatment −"]
[null,null,"Name of the Hospital"]
[null,null,"Charges for hospital treatment, indicating separately the charges for −"]
[null,null,"(i)","Accomodation",null,null,0]
[null,null,null,"(State whether it was according to the status or pay of the Government servant and in cases where the accomodation is higher than the status of the Government servant, a certificate should be attached to the effect that the accomodation to which he was entitled was not available.)"]
[null,null,"(ii)","Diet",null,null,0]
[null,null,"(iii)","Surgical operation or medical treatment",null,null,0]
[null,null,"(iv)","Pathological, bacteriological, radiological or other similar tests, indicating −"]
[null,null,null,"(a) The name of the hospital or laboratory at which test(s) were undertaken"]
[null,null,null,"(b) Whether test(s) were undertaken on the advice of the medical officer-in-charge of the case at the hospital. If so, certificate to that effect should be attached"]
[null,null,"(v)","Medicines"]
[null,null,"(vi)","Special medicines\n(Cash memos and the essentiality certificates should be attached.)",null,null,0]
[null,null,"(vii)","Ordinary nursing",null,null,0]
[null,null,"(viii)","Special nursing, i.e., nurses, specially engaed for the patient. State whether they are employed on the advice of the medical officer-in-charge of the case at the hospital or at the request of the Government servant or patient. In the former case a certificate from th medical officer-in-charge of the case and countersigned by the Medical Superintendent of the hospital should be attached.",null,null,0]
[null,null,"(ix)","Ambulance charges\n(State the journey− to and fro− undertaken)",null,null,0]
[null,null,"(x)","Any other charges, e.g., charges for electric light, fan, heater, air-conditioning, etc. State also whether the facilities referred to are a part of the facilities normally provided to all patients and no choice was left to the patient.",null,null,0]
[null,"NOTE 1.− If the treatment was received by the Government servant at his residence under Rule 7 of the C.S.(M.A.) Rules, 1944, give particulars of such treatment and attach a cerificate from the authorised medical attendant as required by these rules."]
[null,"NOTE 2.− If the treatment was received at a hospital other than a Government hospital, necessary details and the certificate of the authorised medical attendant that the requisite treatment was not available in any nearest Government hospital should be firnished."]
[null,null,"II. Consultation with Specialist −"]
[null,null,"Fees paid to a Specialist or a Medical Officer other than the authorised medical attendant, indicating−"]
[null,null,"(a)","the name and designation of the Specialist or Medical Officer consulted and the hospital to which attached"]
[null,null,"(b)","numbers and dates of consultations and the fees charged for each consultation"]
[null,null,"Sl No.","Date","Name & Degination of Doctor",null,"Total"]
[null,null,1]
[null,null,2]
[null,null,3]
[null,null,4]
[null,null,5]
[null,null,6]
[null,null,"Total `",null,null,null,{"$f":"SUM(G40:G45)","v":0}]
[null,null,"( c)","whether consultation was had at the hospital, at the consulting room of the Specialist or Medical Officer, or at the residence of the patient"]
[null,null,"(d)","whether the Specialist or Medical Officer was consulted on the advice of the authorised medical attendant and the prior approval of the Chief Administrative Medical Officer of the State was obtained. If so, a certificate to that effect should be attached"]
[10,null,"Total amount claimed",null,":",{"$f":"+G36+G20+G22+G23+G24+G27+G28+G29+G30+G31+G32","v":0}]
[11,null,"Less advance taken on",null,":",0]
[12,null,"Net amount claimed",null,":",{"$f":"+F49-F50","v":0}]
[13,null,"List of enclosures"]
["₹",{"$f":"+spellindian(F51)","v":"No Rupees Only"}]
["DECLARATION TO BE SIGNED BY THE GOVERNMENT SERVANT"]
[]
["I hereby declare that the statements in this application are true to the best of my knowlwdge and belief and that the person for whom medical expenses were incurred is wholly dependent upon me."]
[]
[]
["Date",{"$f":"+NOW()","v":"2023-10-20T10:34:13.740"}]
[null,"dd/mm/yyyy",null,null,null,null,"Signature of the Government servant and Office to which attached"]
[]
[]
[]
[]
[]
[]
[]
[]
[]
[]
[]
[]
[]
[]
[]
[]
[]
[]
[]
[]
[]
[]
[]
[]
[]
[]
[]
[]
[]
[]
[]
[]
[]
[]
[]
[]
[]
[]
[]
[]
[]
[]
[]
[]
[]
[]
[]
[]
[]
[]
[]
[]
[]
[]
[]
[]
[]
[]
[]
[]
[]
[]
[]
[]
[]
[]
[]
[]
[]
[]
[]
[]
[]
[]
[]
[]
[]
[]
[]
[]
[]
[]
[]
[]
[]
[]
[]
[]
[]
[]
[]
[]
[]
[]
[]
[]
[]
[]
[]
[]
[]
[]
[]
[]
[]
[]
[]
[]
[]
[]
[]
[]
[]
[]
[]
[]
[]
[]
[]
[]
[]
[]
[]
[]
[]
[]
[]
[]
[]
[]
[]
[]
[]
[]
[]
[]
[]
[]
[]
[]
[]
[]
[]
[]
[]
[]
[]
[]
[]
[]
[]
[]
[]
[]
[]
[]
[]
[]
[]
[]
[]
[]
[]
[]
[]
[]
[]
[]
[]
[]
[]
[]
[]
[]
[]
[]
[]
[]
[]
[]
[]
[]
[]
[]
[]
[]
[]
[]
[]
[]
[]
[]
[]
[]
[]
[]
[]
[]
[]
[]
[]
[]
[]
[]
[]
[]
[]
[]
[]
[]
[]
[]
[]
[]
[]
[]
[]
[]
[]
[]
[]
[]
[]
[]
[]
[]
[]
[]
[]
[]
[]
[]
[]
[]
[]
[]
[]
[]
[]
[]
[]
[]
[]
[]
[]
[]
[]
[]
[]
[]
[]
[]
[]
[]
[]
[]
[]
[]
[]
[]
[]
[]
[]
[]
[]
[]
[]
[]
[]
[]
[]
[]
[]
[]
[]
[]
[]
[]
[]
[]
[]
[]
[]
[]
[]
[]
[]
[]
[]
[]
[]
[]
[]
[]
[]
[]
[]
[]
[]
[]
[]
[]
[]
[]
[]
[]
[]
[]
[]
[]
[]
[]
[]
[]
[]
[]
[]
[]
[]
[]
[]
[]
[]
[]
[]
[]
[]
[]
[]
[]
[]
[]
[]
[]
[]
[]
[]
[]
[]
[]
{"$rows_left_out":601}
{"sheet":"97-B","index":1,"n_rows":1000,"n_cols":90,"rows_kept":1000,"cut":false,"hidden":false,"merged":[[66,1,66,3],[67,1,67,3],[49,4,49,5],[50,4,50,5],[51,4,51,5],[52,4,52,5],[53,2,53,5],[27,2,27,5],[67,6,67,8],[37,3,37,5],[38,2,38,5],[41,2,41,5],[58,2,58,3],[59,0,59,1],[59,2,59,3],[61,0,61,8],[62,0,62,8],[63,0,63,8],[54,3,54,5],[54,6,54,8],[55,3,55,5],[55,6,55,8],[56,0,56,1],[56,2,56,3],[40,3,40,5],[40,6,40,8],[41,6,41,8],[56,6,59,8],[57,0,57,1],[57,2,57,3],[58,0,58,1],[46,4,46,5],[46,7,53,8],[47,4,47,5],[48,4,48,5],[42,6,42,8],[43,2,43,5],[43,6,43,8],[44,3,44,5],[44,6,44,8],[45,3,45,5],[45,6,45,8],[28,3,28,5],[28,6,28,8],[37,6,37,8],[38,6,38,8],[39,3,39,5],[39,6,39,8],[33,4,33,5],[34,4,34,5],[35,4,35,5],[29,7,36,8],[30,4,30,5],[31,4,31,5],[32,4,32,5],[36,2,36,5],[29,4,29,5],[18,6,18,8],[18,3,18,5],[19,3,19,5],[19,6,19,8],[20,4,20,5],[15,0,15,1],[15,2,15,5],[15,6,15,8],[17,2,17,5],[16,2,16,8],[17,6,17,8],[20,7,27,8],[21,4,21,5],[22,4,22,5],[23,4,23,5],[24,4,24,5],[25,4,25,5],[26,4,26,5],[13,0,13,1],[13,2,13,5],[13,6,13,8],[14,0,14,1],[14,2,14,5],[14,6,14,8],[11,0,11,1],[11,2,11,5],[11,6,11,8],[12,0,12,1],[12,2,12,5],[12,6,12,8],[0,0,0,8],[2,0,2,8],[3,0,3,6],[4,0,7,0],[4,2,4,5],[4,6,4,8],[5,2,5,5],[5,6,5,8],[6,2,6,5],[6,6,6,8],[9,0,9,1],[9,2,9,5],[10,2,10,5],[9,6,9,7],[10,6,10,8],[10,0,10,1],[7,2,7,5],[7,6,7,8],[8,0,8,1],[8,2,8,5],[8,6,8,8]]}
["Central Pollution Control Board, Delhi"]
[null,null,null,null,null,null,null,null,"Med. 97-B"]
["Form of application for claiming refund of medical expenses incurred\n in connection with medical attendance and/or treatment of Central Government servants or their families-For Medical Attendance by Authorised Medical Attendant (AMA)"]
[null,null,null,null,null,null,null,"CP NO.","CPCB0000"]
[1,null,"Name of Government Servant \n(In block letters)",null,null,null,{"$f":"VLOOKUP($I$4, $A$499:$CL$999,3,)","v":0}]
[null,null,"Degination of the Government Servent\n(In block letters)",null,null,null,{"$f":"VLOOKUP($I$4, $A$499:$CL$999,2,)","v":0}]
[null,"(i)","whether married or unmarried \n(Strike out which ever is not applicable)",null,null,null,"YES   /    NO"]
[null,"(ii)","if yes, the place where wife/husband is employed"]
[2,null,"Office in which employed",null,null,null,{"$f":"VLOOKUP($I$4,$A$501:$CL$1001,5,)","v":0}]
[3,null,"Pay of the Government servant as defined in the Fundamental Rules, and any other emoluments which should be shown separately",null,null,null,"BASIC ",null,{"$f":"VLOOKUP($I$4,$A$501:$CL$1001,9,)","v":0}]
[4,null,"Level of Pay and applied Cell",null,null,null,{"$f":"VLOOKUP($I$4, $A$499:$CL$999,85,)","v":0}]
[4,null,"Place of duty",null,null,null,{"$f":"VLOOKUP($I$4,$A$501:$CL$1001,5,)","v":0}]
[5,null,"Actual residential address"]
[6,null,"Name of the patient and his/her relationship to the Government servant\nN.B. - In the case of children, state age also."]
[7,null,"Place at which the patient fell ill"]
[8,null,"Details of the amount claimed:",null,null,null,{"$f":"+F59","v":0}]
[null,null,"I. Medical Attendance −"]
[null,null,"(i) Fees for consultation indicating−"]
[null,null,"(a)","the name and designation of the medical officer consulted and the hospital or dispensary to which attached"]
[null,null,"(b)","the number and dates of consultation and the fees paid for each consultation",null,null,{"$f":"+G28","v":0}]
[null,null,"Sl No.","Date","Name & Degination of Doctor",null,"Total"]
[null,null,1]
[null,null,2]
[null,null,3]
[null,null,4]
[null,null,5]
[null,null,6]
[null,null,"Total `",null,null,null,{"$f":"SUM(G22:G27)","v":0}]
[null,null,"(c)","the number and dates of injection and the fee paid for each injection",null,null,{"$f":"+G37","v":0}]
[null,null,"Sl No.","Date","Details of Injection(s)",null,"Total"]
[null,null,1]
[null,null,2]
[null,null,3]
[null,null,4]
[null,null,5]
[null,null,6]
[null,null,"Total `",null,null,null,{"$f":"SUM(G31:G36)","v":0}]
[null,null,"(d)","whether consultations and/or injections were had at the hospital, at the consulting room of the medical officer or at the residence of the patient"]
[null,null,"(ii) Charges for pathological, bacteriological, radiological, or other similar tests undertaken during diagnosis indicating−"]
[null,null,"(a)","the name of the hospital or laboratory where undertaken; and"]
[null,null,"(b)","whether the tests were undertaken on the advice of the authorised medical attendant. If so, a certificate to that effect should be attached"]
[null,null,"(iii) Cost of medicines purchased from the market\n        (Cash memos and the essentiality certificates \n           should be attached)"]
[null,null,"II. Consultation with Specialist −"]
[null,null,"Fees paid to a Specialist or a Medical Officer other than the authorised medical attendant, indicating−",null,null,null,{"$f":"+G54","v":0}]
[null,null,"(a)","the name and designation of the Specialist or Medical Officer consulted and the hospital to which attached"]
[null,null,"(b)","numbers and dates of consultations and the fees charged for each consultation"]
[null,null,"Sl No.","Date","Name & Degination of Doctor",null,"Total"]
[null,null,1,null,null,null,0]
[null,null,2]
[null,null,3]
[null,null,4]
[null,null,5]
[null,null,6]
[null,null,"Total `",null,null,null,{"$f":"SUM(G48:G53)","v":0}]
[null,null,"( c)","whether consultation was had at the hospital, at the consulting room of the Specialist or Medical Officer, or at the residence of the patient"]
[null,null,"(d)","whether the Specialist or Medical Officer was consulted on the advice of the authorised medical attendant and the prior approval of the Chief Administrative Medical Officer of the State was obtained. If so, a certificate to that effect should be attached"]
[9,null,"Total amount claimed",null,":",{"$f":"+G44+G42+G39+G29+G20+G18","v":0}]
[10,null,"Less advance taken on",null,":",0]
[11,null,"Net amount claimed",null,":",{"$f":"+F57-F58","v":0}]
[12,null,"List of enclosures"]
["`",{"$f":"+spellindian(F59)","v":"No Rupees Only"}]
["DECLARATION TO BE SIGNED BY THE GOVERNMENT SERVANT"]
[]
["I hereby declare that the statements in this application are true to the best of my knowlwdge and belief and that the person for whom medical expenses were incurred is wholly dependent upon me."]
[]
[]
["Date",{"$f":"+NOW()","v":"2023-10-20T10:34:13.740"}]
[null,"dd/mm/yyyy",null,null,null,null,"Signature of the Government servant and Office to which attached"]
[]
[]
[]
[]
[]
[]
[]
[]
[]
[]
[]
[]
[]
[]
[]
[]
[]
[]
[]
[]
[]
[]
[]
[]
[]
[]
[]
[]
[]
[]
[]
[]
[]
[]
[]
[]
[]
[]
[]
[]
[]
[]
[]
[]
[]
[]
[]
[]
[]
[]
[]
[]
[]
[]
[]
[]
[]
[]
[]
[]
[]
[]
[]
[]
[]
[]
[]
[]
[]
[]
[]
[]
[]
[]
[]
[]
[]
[]
[]
[]
[]
[]
[]
[]
[]
[]
[]
[]
[]
[]
[]
[]
[]
[]
[]
[]
[]
[]
[]
[]
[]
[]
[]
[]
[]
[]
[]
[]
[]
[]
[]
[]
[]
[]
[]
[]
[]
[]
[]
[]
[]
[]
[]
[]
[]
[]
[]
[]
[]
[]
[]
[]
[]
[]
[]
[]
[]
[]
[]
[]
[]
[]
[]
[]
[]
[]
[]
[]
[]
[]
[]
[]
[]
[]
[]
[]
[]
[]
[]
[]
[]
[]
[]
[]
[]
[]
[]
[]
[]
[]
[]
[]
[]
[]
[]
[]
[]
[]
[]
[]
[]
[]
[]
[]
[]
[]
[]
[]
[]
[]
[]
[]
[]
[]
[]
[]
[]
[]
[]
[]
[]
[]
[]
[]
[]
[]
[]
[]
[]
[]
[]
[]
[]
[]
[]
[]
[]
[]
[]
[]
[]
[]
[]
[]
[]
[]
[]
[]
[]
[]
[]
[]
[]
[]
[]
[]
[]
[]
[]
[]
[]
[]
[]
[]
[]
[]
[]
[]
[]
[]
[]
[]
[]
[]
[]
[]
[]
[]
[]
[]
[]
[]
[]
[]
[]
[]
[]
[]
[]
[]
[]
[]
[]
[]
[]
[]
[]
[]
[]
[]
[]
[]
[]
[]
[]
[]
[]
[]
[]
[]
[]
[]
[]
[]
[]
[]
[]
[]
[]
[]
[]
[]
[]
[]
[]
[]
[]
[]
[]
[]
[]
[]
[]
[]
[]
[]
[]
[]
[]
[]
[]
[]
[]
[]
[]
[]
[]
[]
[]
[]
[]
[]
{"$rows_left_out":601}
{"sheet":"Instructions for 97A","index":2,"n_rows":31,"n_cols":2,"rows_kept":31,"cut":false,"hidden":false,"merged":[[7,1,7,4]]}
["Instructions for filling the form no. 97A:"]
[1,"write CP No. in the column provided at the beginning of the format:"]
[null,"for example:"]
[null,"if someone CP no. is 786"]
[null,"Write as CPCB0786"]
[]
[2,"Column 5:"]
[null,"Actual residential address:"]
[null,"write the actual address."]
[]
[3,"Column 6:"]
[null,"Name of the patient and his/her relationship to the Government servant\nN.B. - In the case of children, state age also."]
[null,"Write the necessary details."]
[]
[4,"Column 7:"]
[null,"Place at which the patient fell ill"]
[null,"Fill all the necessary details as per the format."]
[]
[5,"Column 8 (I):"]
[null,"Name of the Hospital"]
[null,"Fill all the necessary details as per the format."]
[]
[6,"Column 8 (II):"]
[null,"Consultation with Specialist −"]
[null,"Fill all the necessary details as per the format."]
[]
[7,"Column 10:"]
[null,"Advance taken:"]
[null,"Fill the amount of advance taken, if any."]
[]
[8,"Take the print out, sign it and submit through proper channel for remibursement."]

{"sheet":"Instructions for 97B","index":3,"n_rows":28,"n_cols":2,"rows_kept":28,"cut":false,"hidden":false,"merged":[[6,1,6,4],[15,1,15,4]]}
["Instructions for filling the form no. 97B:"]
[1,"write CP No. in the column provided at the beginning of the format:"]
[null,"for example:"]
[null,"if someone CP no. is 786"]
[null,"Write as CPCB0786"]
[2,"Column 5:"]
[null,"Actual residential address:"]
[null,"write the actual address."]
[3,"Column 6:"]
[null,"Name of the patient and his/her relationship to the Government servant\nN.B. - In the case of children, state age also."]
[null,"Write the necessary details."]
[4,"Column 7:"]
[null,"Place at which the patient fell ill"]
[null,"Fill all the necessary details as per the format."]
[5,"Column 8 (I):"]
[null,"(i) Fees for consultation indicating various details:"]
[null,"Fill all the necessary details as per the format."]
[6,"Column 8 (I):"]
[null,"(ii) Charges for pathological, bacteriological, radiological, or other similar tests undertaken during diagnosis indicating various details:"]
[null,"Fill all the necessary details as per the format."]
[null,"Column 8 (II):"]
[null,"II. Consultation with Specialist −"]
[null,"Fill all the necessary details as per the format."]
[7,"Column 10:"]
[null,"Advance taken:"]
[null,"Fill the amount of advance taken, if any."]
[]
[8,"Take the print out, sign it and submit through proper channel for remibursement."]

{"sheet":"Annexure-97A","index":4,"n_rows":21,"n_cols":9,"rows_kept":21,"cut":false,"hidden":false,"merged":[[20,7,20,8],[5,0,5,1],[5,2,5,4],[5,7,5,8],[0,0,0,8],[1,0,1,8],[5,5,6,5],[5,6,6,6],[3,0,3,2]]}
["Annexure to Form no. 97-A"]
["Details of amount claimed for medical reimbursement under CSMA Scheme"]
["1. Name:",{"$f":"'97-A'!$G$5","v":0},null,null,null,null,"2. Designation:",{"$f":"'97-A'!$G$6","v":0}]
["4. Patient's Name & Relation with the official:",null,null,{"$f":"'97-A'!$G$14","v":"SELF"},null,null,null,"3. CP No.:",{"$f":"'97-A'!$I$4","v":"CPCB0000"}]
["5. Extension No.:",null,null,null,null,null,"6. Bank Account Number:",null,{"$f":"+VLOOKUP('97-A'!I4,'97-A'!A501:F989,6,)","v":{"$error":"#N/A"}}]
["Prescription",null,"Bill/Receipt Details",null,null,"** Nature of Bill (C.F./M/L.T.)","Amount Claimed","To be filled in by F&A Division"]
["Encl No.","Date","Encl. No.","Bill / Receipt No.","Date",null,null,"Amount Passed","Remarks (if any)"]
[]
[]
[]
[]
[]
[]
[]
[]
[]
[]
[]
["Note:- 1. All enclosures are to be serially numbered.",null,null,null,null,"** C.F. Consultation Fees"]
["2. Bills/ Receipts should be attached with the relevant prescription.",null,null,null,null,"M - Medicines"]
["3. Please also submit the copy of CSMA ID.",null,null,null,null,"L.T. - Lab Tests",null,"Signature of the official with date"]

{"sheet":"Annexure-97B","index":5,"n_rows":21,"n_cols":9,"rows_kept":21,"cut":false,"hidden":false,"merged":[[20,7,20,8],[0,0,0,8],[1,0,1,8],[3,0,3,2],[5,0,5,1],[5,2,5,4],[5,5,6,5],[5,6,6,6],[5,7,5,8]]}
["Annexure to Form no. 97-B"]
["Details of amount claimed for medical reimbursement under CSMA Scheme"]
["1. Name:",{"$f":"'97-B'!$G$5","v":0},null,null,null,null,"2. Designation:",{"$f":"'97-B'!$G$6","v":0}]
["4. Patient's Name & Relation with the official:",null,null,{"$f":"'97-B'!$G$14","v":0},null,null,null,"3. CP No.:",{"$f":"'97-B'!$I$4","v":"CPCB0000"}]
["5. Extension No.:",null,null,null,null,null,"6. Bank Account Number:",null,{"$f":"+VLOOKUP(I4,'97-B'!A501:F946,6,)","v":{"$error":"#N/A"}}]
["Prescription",null,"Bill/Receipt Details",null,null,"** Nature of Bill (C.F./M/L.T.)","Amount Claimed","To be filled in by F&A Division"]
["Encl No.","Date","Encl. No.","Bill / Receipt No.","Date",null,null,"Amount Passed","Remarks (if any)"]
[]
[]
[]
[]
[]
[]
[]
[]
[]
[]
[]
["Note:- 1. All enclosures are to be serially numbered.",null,null,null,null,"** C.F. Consultation Fees"]
["2. Bills/ Receipts should be attached with the relevant prescription.",null,null,null,null,"M - Medicines"]
["3. Please also submit the copy of CSMA ID.",null,null,null,null,"L.T. - Lab Tests",null,"Signature of the official with date"]